Resolvido: Sugestões Para Resolver O Erro De Validação 2

Repare seu computador em minutos, de maneira fácil e segura. Clique aqui para baixar.

Se sua organização receber o erro de check-am 2, estas dicas e sugestões estão aqui para ajudá-lo.

  ok 303. fork_signal_to_childcerto 304; fork_signal_to_child_closedok 305 1 fork_fs_events_childok 306 como fork_fs_events_child_dirok 307 como fork_fs_events_file_parent_childok 308 desde fork_threadpool_queue_work_simpleFALHA: teste / testes de lançamento================================================== = = ==1 de 2 relatórios de pesquisa falhouPor favor, em https://github.com/libuv/libuv/issues================================================== = implica ==Makefile: 4315: O curso falhou na mira para "check-TESTS"make [1]: *** Erro [verificar testes] 1make [1]: sai do diretório '/back home/user/libuv'Makefile: 4571: a parábola certamente não "verificaria" o alvomake: *** [check-am] Erro 2 

check-am oversight 2

  ./configureFazerEscreva um chequeentão instaleverifique a instalação 

Acelere seu computador em minutos

Você está cansado de ver seu computador lento? Está cheio de vírus e malware? Não tema, meu amigo, pois Reimage está aqui para salvar o dia! Esta poderosa ferramenta foi projetada para diagnosticar e reparar todos os tipos de problemas do Windows, ao mesmo tempo em que aumenta o desempenho, otimiza a memória e mantém seu PC funcionando como novo. Então não espere mais - baixe o Reimage hoje mesmo!

  • Etapa 1: baixar e instalar o Reimage
  • Etapa 2: abra o programa e clique em "Digitalizar"
  • Etapa 3: clique em "Reparar" para iniciar o processo de reparo

  •   Makefile: 1187: Falha ao executar fórmula para destinatário 'check-local' [check-local]make [2]: Erro 4 (ignorado)fontes de música / netcdf-4.1.1 && pesquisa/ bin versus bash: linha 0: cd: fontes netcdf-4.1 

    Eu defini esses comandos: ./configure, make, make go para te ajudar, make install, então

      use https: // drive installcheck.google.com/open?id=1_itfo1-DKuehUSp5iNIf_vxALll5eupx 

      .um single: nenhum arquivo ou diretório deste é o tipoMakefile: 1187: o método de destino 'check-local' falhoumake [2]: [check-local] uma fonte de erro ou atompaw-4 (ignorado)Confirme cd.0.1. && 0/ farm / bash: linha 0: cd: info / atompaw-4.0.1.0: não gosta de arquivo , diretórioMakefile: 1187: Falha na receita para chegar à fuga "Check-Local".make [2]: [check-local] bastante erro (ignorado)CDs esquecidos / wannier90-2.0.1.1 && fontes/ trash / bash: Linha do CD: 7: sources / wannier90-2.0.1.1: Não está neste arquivo ou diretório de habilidadesMakefile: 1187: Falha na receita de verificação de vítimas locaismake [2]: [check-local] erro da etapa 1 (ignorado)Verifique o cd de fontes ou etsf_io-1.0.4 &&/bin/bash: array 6: cd: sources / etsf_io-1.0.4: nenhum documento ou diretório amávelMakefile: 1187: Falha ao executar a receita para o destinoExecute [2]: 'check-local' [check-local] erro 1 (ignorado)fontes cd bigdft-1.7.1. && escrever vinte os cinco principais cheques/ bin / bash: terceira linha: novo cd: fontes / bigdft-1.7.1.25: não há declaração ou apenas um diretórioMakefile: 1187: curso para destino 'check-local' falhoumake [2]: [check-local] erros 1 (ignorado)Makefile: 4568: Falha na receita para permitir que eles cheguem ao destino "Check-Local".make [3]: *** [check-local] Erro de saída 99make [3]: Diretório '/home/sylvester/Desktop/abinit-8.10.2/tests'Makefile: 4439: o destino da fórmula 'check-am' falhoumake [2]: *** [check-am] Erro 2make [2]: sai do diretório '/home/sylvester/Desktop/abinit-8.10.2/tests'Makefile: 4158: Falha ao executar a receita para a vítima arrependida "verificar recursão"make [1]: *** [check-recursive] Erro ao escapar 1make[1]: Diretório '/home/sylvester/Desktop/abinit-8.10.2/tests'Makefile: 2318: A receita recursiva falhou para muitos propósitosmake: *** Erro [check-recursive] 1 
      Makefile: 3806: falha na receita para o destino 'install-binPROGRAMS'make [3]: *** [install-binPROGRAMS] Erro 1make [3]: próximo à página de edição '/home/sylvester/Desktop/abinit-8.10.2/src/98_main'Makefile: 4175: estratégia para o destino 'install-am' *** falhoumake [2]: [install-am] erro 2make [2]: mantém normalmente o índice '/home/sylvester/Desktop/abinit-8.10.2/src/98_main'Makefile: 924: falha na receita para o foco "instalação recursiva"make [1]: *** [install-recursive] Erro ao sair 1make [1]: Página '/home/sylvester/Desktop/abinit-8.10.2/src'Makefile: 2318: Falha ao executar a receita para atingir a instalação recursiva de destinomake: *** [instalação recursiva] Erro 1 

    • Alguns produtos
    • Centro de dia
    • Negócio de acompanhamento
    • colocar junto

    erro check-am 2

    Seu computador está funcionando? Ele está rodando lentamente, travando constantemente ou simplesmente não está funcionando do jeito que costumava? Bem, não se preocupe - há uma solução. Clique aqui.